# Pastix4calculix installation error ~/build.make:64: \*\*\* missing separator. Stop

**URL:** <https://calculix.discourse.group/t/pastix4calculix-installation-error-build-make-missing-separator-stop/1052>\
**Category:** Uncategorized\
**Created:** [March 27, 2022, 9:27am UTC](https://calculix.discourse.group/t/pastix4calculix-installation-error-build-make-missing-separator-stop/1052 "2022-03-27T09:27:06Z")\
**Posts on this page:** 1\
**Showing post:** 3

<div class="post-metadata">

**Author:** ![W.H.Meng](https://avatars.discourse-cdn.com/v4/letter/w/a587f6/32.png) [@W.H.Meng](https://calculix.discourse.group/u/W.H.Meng)\
**Post date:** [April 4, 2022, 10:25am UTC](https://calculix.discourse.group/t/pastix4calculix-installation-error-build-make-missing-separator-stop/1052/3 "2022-04-04T10:25:44Z")

</div>

With adding `-DPASTIX_WITH_MPI=ON ` in make\_pastix.sh, it seems OK.  
Then when compiling ccx\_2.19 with pastix, same error as [kmallick](https://calculix.discourse.group/u/kmallick) had.

> [@Cannot compile ccx\_2.17 with PaStiX](https://calculix.discourse.group/t/cannot-compile-ccx-2-17-with-pastix/288):
>
> I need some help. I am using stock source of ccx 2.17 and following README to compile in Ubuntu 20.04. I have gone though all the steps to make OpenBLAS, hwloc, parsec, scotch and pastix. Ihave installed CUDA 11.1 and modified the make files as needed. When I run Makefile\_i8 I get the following error: /usr/bin/ld: …/…/…/PaStiX/pastix\_i8/lib/libpastix.a(isched\_hwloc.c.o): undefined reference to symbol ‘hwloc\_bitmap\_iszero’ /usr/bin/ld: …/…/…/PaStiX/hwloc\_i8/lib/libhwloc.so: error adding symbol…

> /usr/bin/ld: …/…/…/PaStiX/pastix\_i8/lib/libpastix.a(isched\_hwloc.c.o): undefined reference to symbol ‘hwloc\_bitmap\_iszero’  
> /usr/bin/ld: …/…/…/PaStiX/hwloc\_i8/lib/libhwloc.so: error adding symbols: DSO missing from command line  
> collect2: error: ld returned 1 exit status  
> make: \*\*\* [Makefile\_i8:39: ccx\_2.19\_i8] Error 1

Unfortunately, I didn’t get succeed when adding …/…/…/PaStiX/hwloc\_i8/lib/libhwloc.so to the end as Kmallick did.

---

_[View the full topic](https://calculix.discourse.group/t/pastix4calculix-installation-error-build-make-missing-separator-stop/1052)._
